{"text_format":"1","workbook":"xlsx","n_sheets":5,"sheets":["DATOS","UNITARIOS","PRESUPUESTO","MEDICION","Hoja2"],"not_rendered":{"charts":0,"images":1,"macros":1,"external_links":0,"defined_names":0,"comments":0,"pivot_tables":0},"unopened":[],"bounds":{"document_bytes":16777216,"sheet_cells":100000,"rows_first":2000,"rows_last":500,"rows_between":2000,"halvings":0,"cell_chars":16384,"cell_head_chars":4096},"cells_cut":0,"cells_raw":0,"read":"whole","date_system":"1900"}

{"sheet":"DATOS","index":0,"n_rows":154,"n_cols":8,"rows_kept":154,"cut":false,"hidden":false,"merged":[]}
[]
[null,"c/ AMERIQUES, 11 - EL PERELLÓ - SUECA"]
[null,{"$f":"PRESUPUESTO!I159","v":3196}]
[null,"trabajos a realizar",null,"mediciones"]
["DEMOLICIONES"]
[null,null,null,"BAJA","MEDIA","ALTA","INTRO"]
[1,"Demolición de pavimento existente en LA ZONA DE ACTUACIÓN, de baldosas de piedra natural, terrazo o gres, y picado del material de agarre, con medios manuales y carga manual de escombros sobre camión o contenedor.","m2",5,null,null,0]
[null,null,null,"BAJA","MEDIA","ALTA","INTRO"]
[null,"Demolición de chapado de placas de piedra natural y picado de la capa base de mortero, con medios manuales, y carga manual de escombros sobre camión o contenedor.","m2"]
[null,null,null,"BAJA","MEDIA","ALTA","INTRO"]
[null,"Demolición de alicatado de azulejo y picado de la capa base de mortero, con medios manuales, y carga manual de escombros sobre camión o contenedor.","m2",null,0]
[null,null,null,"BAJA","MEDIA","ALTA","INTRO"]
[null,"Levantado de panelado de madera en paredes existentes en zaguan","m2"]
[null,null,null,"BAJA","MEDIA","ALTA","INTRO"]
[null,"Desmontaje y retirada de espejos/decoración existentes en paredes. Sin transporte a vertedero.","m2"]
[null,null,null,"RECUPERAR","NO RECUP."]
[null,"Levantado de barandillas y pasamanos metálicos, con retirada de escombros y carga, a pie de obra.","ud",null,0]
[null,null,null,"RECUPERAR","NO RECUP."]
[null,"Desmontaje de hoja de puerta interior de paso de carpintería de madera, galces, tapajuntas y herrajes, con medios manuales y carga manual del material desmontado sobre camión o contenedor.","ud"]
[null,null,null,"BAJAR(COTA 0)","CEGADO+APERTURA (90º-180º)","QUITAR+NUEVA(FURE)"]
[null,"Levantado, recolocación, cegado de hueco y colocación de puertas de ascensor, según tipo de operación. Incluso p.p. de remates. Medida la unidad terminada y funcionando.","ud",0,0]
[null,null,null,"NO COMPLEJO","COMPLEJO"]
[null,"Demolición de relleno de zaguan,escalera,zona perimetral del ascensor, hasta llegar a nivel de acceso, ","m3",0]
[null,null,null,"HASTA 9 PELD",">9 PELD.","COMPLETA"]
[null,"Demolición parte de escalera a remodelar. Incluso retirada de escombro a pie de carga.","ud",0]
[null,null,null,"CANTIDAD"]
[null,"Demolición de peldañeado existente","ud",0]
[null,null,null,"M2"]
[null,"Demolición de tabicones de ladrillo hueco doble, por medios manuales, incluso limpieza y retirada de escombros a pie de carga, sin transporte al vertedero y con p.p. de medios auxiliares.","m2"]
[null,null,null,"BAJA","MEDIA","ALTA","INTRO."]
[null,"Demolición de falsos techos continuos de placas de escayola, yeso, corcho o material similar, por medios manuales, incluso limpieza y retirada de escombros a pie de carga, sin transporte al vertedero y con p.p. de medios auxiliares.","m2"]
[null,null,null,"DESMONTAJR","REUBICAR"]
[null,"Desmontaje de buzones, con retirada a vertedero",null,0,0]
[null,null,null,"BAJAR","REHACER","IMPERM.","COMPLETO","INTRO"]
[null,"Realización de foso necesario para cumplir normativa.","ud",0,null,null,0]
[null,null,null,"CANCELAS","SANITARIOS","JARDINERAS","INTRO"]
[2,"Demolición de otros elementos existentes en la zona de actuación. Sin recuperación del material.","ud",1]
[null,null,null,"BAJA","MEDIA","ALTA","INTRO."]
[null,"Alquiler de contenedor para retirada de escombros a vertedero. Incluso p.p. de tasas y permisos necesarios.","ud",null,0]
[]
{"$rows_left_out":115}
{"sheet":"UNITARIOS","index":1,"n_rows":154,"n_cols":8,"rows_kept":154,"cut":false,"hidden":false,"merged":[]}
[]
[]
[]
[]
["DEMOLICIONES"]
[null,null,null,"BAJA","MEDIA","ALTA","INTRO"]
[null,"PAVIMENTO",null,9.5,10.5,11.5]
[null,null,null,"BAJA","MEDIA","ALTA","INTRO"]
[null,"CHAPADO",null,10.5,11.5,12.5]
[null,null,null,"BAJA","MEDIA","ALTA","INTRO"]
[null,"ALICATADO",null,9.5,10.5,11.5]
[null,null,null,"BAJA","MEDIA","ALTA","INTRO"]
[null,"PANELADO",null,6.9,9.9,10.9]
[null,null,null,"BAJA","MEDIA","ALTA","INTRO"]
[null,"ESPEJOS/DECORACIÓN",null,250,350,550]
[null,null,null,"RECUPERAR","NO RECUP."]
[null,"BARANDILLAS",null,120,85]
[null,null,null,"RECUPERAR","NO RECUP."]
[null,"PUERTAS",null,60,25]
[null,null,null,"BAJAR(COTA 0)","CEGADO+APERTURA (90º-180º)","QUITAR+NUEVA(FURE)"]
[null,"PUERTAS ASC.",null,450,550,350]
[null,null,null,"NO COMPLEJO","COMPLEJO"]
[null,"RELLENO",null,65,75]
[null,null,null,"HASTA 9 PELD",">9 PELD.","COMPLETA"]
[null,"ESCALERA",null,385,450,650]
[null,null,null,"CANTIDAD"]
[null,"PELDAÑOS",null,30]
[null,null,null,"M2"]
[null,"TABIQUES",null,12]
[null,null,null,"BAJA","MEDIA","ALTA","INTRO."]
[null,"TECHOS",null,4.4000000000000004,5.4,6.3]
[null,null,null,"DESMONTAJR","REUBICAR"]
[null,"BUZONES",null,60,100]
[null,null,null,"BAJAR","REHACER","IMPERM.","COMPLETO","INTRO"]
[null,"FOSO",null,1050,1600,600,1900]
[null,null,null,"CANCELAS","SANITARIOS","JARDINERAS","INTRO"]
[null,"OTROS",null,90,60,100]
[null,null,null,"BAJA","MEDIA","ALTA","INTRO."]
[null,"CONTENEDORES",null,130,145,150]
[]
{"$rows_left_out":115}
{"sheet":"PRESUPUESTO","index":2,"n_rows":159,"n_cols":9,"rows_kept":159,"cut":false,"hidden":false,"merged":[]}
[]
[null,{"$f":"DATOS!B2","v":"c/ AMERIQUES, 11 - EL PERELLÓ - SUECA"}]
[null,"TOTAL PRESUPUESTO",null,{"$f":"I159","v":3196}]
[null,"trabajos a realizar","citerio de medición","importe",null,null,null,null,"importe total"]
["DEMOLICIONES"]
[]
[null,"Demolición de pavimento existente en LA ZONA DE ACTUACIÓN, de baldosas de piedra natural, terrazo o gres, y picado del material de agarre, con medios manuales y carga manual de escombros sobre camión o contenedor.","m2",{"$f":"IF(DATOS!D7<>0,DATOS!D7*UNITARIOS!D7,\"\")","v":47.5},{"$f":"IF(DATOS!E7<>0,DATOS!E7*UNITARIOS!E7,\"\")","v":""},{"$f":"IF(DATOS!F7<>0,DATOS!F7*UNITARIOS!F7,\"\")","v":""},{"$f":"IF(DATOS!G7<>0,DATOS!G7,\"\")","v":""},null,{"$f":"SUM(D7:H7)","v":47.5}]
[]
[null,"Demolición de chapado de placas de piedra natural y picado de la capa base de mortero, con medios manuales, y carga manual de escombros sobre camión o contenedor.","m2",{"$f":"IF(DATOS!D9<>0,DATOS!D9*UNITARIOS!D9,\"\")","v":""},{"$f":"IF(DATOS!E9<>0,DATOS!E9*UNITARIOS!E9,\"\")","v":""},{"$f":"IF(DATOS!F9<>0,DATOS!F9*UNITARIOS!F9,\"\")","v":""},{"$f":"IF(DATOS!G9<>0,DATOS!G9,\"\")","v":""},null,{"$f":"SUM(D9:H9)","v":0}]
[]
[null,"Demolición de alicatado de azulejo y picado de la capa base de mortero, con medios manuales, y carga manual de escombros sobre camión o contenedor.","m2",{"$f":"IF(DATOS!D11<>0,DATOS!D11*UNITARIOS!D11,\"\")","v":""},{"$f":"IF(DATOS!E11<>0,DATOS!E11*UNITARIOS!E11,\"\")","v":""},{"$f":"IF(DATOS!F11<>0,DATOS!F11*UNITARIOS!F11,\"\")","v":""},{"$f":"IF(DATOS!G11<>0,DATOS!G11,\"\")","v":""},null,{"$f":"SUM(D11:H11)","v":0}]
[]
[null,"Levantado de panelado de madera en paredes existentes en zaguan","m2",{"$f":"IF(DATOS!D13<>0,DATOS!D13*UNITARIOS!D13,\"\")","v":""},{"$f":"IF(DATOS!E13<>0,DATOS!E13*UNITARIOS!E13,\"\")","v":""},{"$f":"IF(DATOS!F13<>0,DATOS!F13*UNITARIOS!F13,\"\")","v":""},{"$f":"IF(DATOS!G13<>0,DATOS!G13,\"\")","v":""},null,{"$f":"SUM(D13:H13)","v":0}]
[]
[null,"Desmontaje y retirada de espejos/decoración existentes en paredes. Sin transporte a vertedero.","m2",{"$f":"IF(DATOS!D15<>0,DATOS!D15*UNITARIOS!D15,\"\")","v":""},{"$f":"IF(DATOS!E15<>0,DATOS!E15*UNITARIOS!E15,\"\")","v":""},{"$f":"IF(DATOS!F15<>0,DATOS!F15*UNITARIOS!F15,\"\")","v":""},{"$f":"IF(DATOS!G15<>0,DATOS!G15,\"\")","v":""},null,{"$f":"SUM(D15:H15)","v":0}]
[]
[null,"Levantado de barandillas y pasamanos metálicos, con retirada de escombros y carga, a pie de obra.","ud",{"$f":"IF(DATOS!D17<>0,DATOS!D17*UNITARIOS!D17,\"\")","v":""},{"$f":"IF(DATOS!E17<>0,DATOS!E17*UNITARIOS!E17,\"\")","v":""},null,null,null,{"$f":"SUM(D17:H17)","v":0}]
[null,null,null,"RECUPERAR","NO RECUP."]
[null,"Desmontaje de hoja de puerta interior de paso de carpintería de madera, galces, tapajuntas y herrajes, con medios manuales y carga manual del material desmontado sobre camión o contenedor.","ud",{"$f":"IF(DATOS!D19<>0,DATOS!D19*UNITARIOS!D19,\"\")","v":""},{"$f":"IF(DATOS!E19<>0,DATOS!E19*UNITARIOS!E19,\"\")","v":""},null,null,null,{"$f":"SUM(D19:H19)","v":0}]
[null,null,null,"BAJAR(COTA 0)","CEGADO+APERTURA (90º-180º)","QUITAR+NUEVA(FURE)"]
[null,"Levantado, recolocación, cegado de hueco y colocación de puertas de ascensor, según tipo de operación. Incluso p.p. de remates. Medida la unidad terminada y funcionando.","ud",{"$f":"IF(DATOS!D21<>0,DATOS!D21*UNITARIOS!D21,\"\")","v":""},{"$f":"IF(DATOS!E21<>0,DATOS!E21*UNITARIOS!E21,\"\")","v":""},{"$f":"IF(DATOS!F21<>0,DATOS!F21*UNITARIOS!F21,\"\")","v":""},null,null,{"$f":"SUM(D21:H21)","v":0}]
[]
[null,"Demolición de relleno de zaguan,escalera,zona perimetral del ascensor, hasta llegar a nivel de acceso, ","m3",{"$f":"IF(DATOS!D23<>0,DATOS!D23*UNITARIOS!D23,\"\")","v":""},{"$f":"IF(DATOS!E23<>0,DATOS!E23*UNITARIOS!E23,\"\")","v":""},null,null,null,{"$f":"SUM(D23:H23)","v":0}]
[]
[null,"Demolición parte de escalera a remodelar. Incluso retirada de escombro a pie de carga.","ud",{"$f":"IF(DATOS!D25<>0,DATOS!D25*UNITARIOS!D25,\"\")","v":""},{"$f":"IF(DATOS!E25<>0,DATOS!E25*UNITARIOS!E25,\"\")","v":""},{"$f":"IF(DATOS!F25<>0,DATOS!F25*UNITARIOS!F25,\"\")","v":""},null,null,{"$f":"SUM(D25:H25)","v":0}]
[]
[null,"Demolición de peldañeado existente","ud",{"$f":"IF(DATOS!D27<>0,DATOS!D27*UNITARIOS!D27,\"\")","v":""},null,null,null,null,{"$f":"SUM(D27:H27)","v":0}]
[]
[null,"Demolición de tabicones de ladrillo hueco doble, por medios manuales, incluso limpieza y retirada de escombros a pie de carga, sin transporte al vertedero y con p.p. de medios auxiliares.","m2",{"$f":"IF(DATOS!D29<>0,DATOS!D29*UNITARIOS!D29,\"\")","v":""},null,null,null,null,{"$f":"SUM(D29:H29)","v":0}]
[]
[null,"Demolición de falsos techos continuos de placas de escayola, yeso, corcho o material similar, por medios manuales, incluso limpieza y retirada de escombros a pie de carga, sin transporte al vertedero y con p.p. de medios auxiliares.","m2",{"$f":"IF(DATOS!D31<>0,DATOS!D31*UNITARIOS!D31,\"\")","v":""},{"$f":"IF(DATOS!E31<>0,DATOS!E31*UNITARIOS!E31,\"\")","v":""},{"$f":"IF(DATOS!F31<>0,DATOS!F31*UNITARIOS!F31,\"\")","v":""},{"$f":"IF(DATOS!G31<>0,DATOS!G31,\"\")","v":""},null,{"$f":"SUM(D31:H31)","v":0}]
[null,null,null,"DESMONTAR","REUBICAR"]
[null,"Desmontaje de buzones, con retirada a vertedero",null,{"$f":"IF(DATOS!D33<>0,DATOS!D33*UNITARIOS!D33,\"\")","v":""},{"$f":"IF(DATOS!E33<>0,DATOS!E33*UNITARIOS!E33,\"\")","v":""},null,null,null,{"$f":"SUM(D33:H33)","v":0}]
[]
[null,"Realización de foso necesario para cumplir normativa.","ud",{"$f":"IF(DATOS!D35<>0,DATOS!D35*UNITARIOS!D35,\"\")","v":""},{"$f":"IF(DATOS!E35<>0,DATOS!E35*UNITARIOS!E35,\"\")","v":""},{"$f":"IF(DATOS!F35<>0,DATOS!F35*UNITARIOS!F35,\"\")","v":""},{"$f":"IF(DATOS!G35<>0,DATOS!G35*UNITARIOS!G35,\"\")","v":""},{"$f":"IF(DATOS!H35<>0,DATOS!H35,\"\")","v":""},{"$f":"SUM(D35:H35)","v":0}]
[null,null,null,"CANCELAS","SANITARIOS","JARDINERAS","INTRO"]
[null,"Demolición de otros elementos existentes en la zona de actuación. Sin recuperación del material.","ud",{"$f":"IF(DATOS!D37<>0,DATOS!D37*UNITARIOS!D37,\"\")","v":90},{"$f":"IF(DATOS!E37<>0,DATOS!E37*UNITARIOS!E37,\"\")","v":""},{"$f":"IF(DATOS!F37<>0,DATOS!F37*UNITARIOS!F37,\"\")","v":""},{"$f":"IF(DATOS!G37<>0,DATOS!G37,\"\")","v":""},null,{"$f":"SUM(D37:H37)","v":90}]
[]
[null,"Alquiler de contenedor para retirada de escombros a vertedero. Incluso p.p. de tasas y permisos necesarios.","ud",{"$f":"IF(DATOS!D39<>0,DATOS!D39*UNITARIOS!D39,\"\")","v":""},{"$f":"IF(DATOS!E39<>0,DATOS!E39*UNITARIOS!E39,\"\")","v":""},{"$f":"IF(DATOS!F39<>0,DATOS!F39*UNITARIOS!F39,\"\")","v":""},{"$f":"IF(DATOS!G39<>0,DATOS!G39,\"\")","v":""},null,{"$f":"SUM(D39:H39)","v":0}]
[]
{"$rows_left_out":120}
{"sheet":"MEDICION","index":3,"n_rows":33,"n_cols":8,"rows_kept":33,"cut":false,"hidden":false,"merged":[]}
[]
[{"$f":"DATOS!B2","v":"c/ AMERIQUES, 11 - EL PERELLÓ - SUECA"}]
[]
[]
["ORDEN","DESCRIPCIÓN","UNIDAD",null,null,null,null,"MEDICIÓN"]
[]
[{"$f":"IFERROR(VLOOKUP(Hoja2!G2,DATOS!$A$7:$G$202,1,FALSE),\"\")","v":1},{"$f":"IFERROR(VLOOKUP(Hoja2!G2,DATOS!$A$7:$G$202,2,FALSE),\"\")","v":"Demolición de pavimento existente en LA ZONA DE ACTUACIÓN, de baldosas de piedra natural, terrazo o gres, y picado del material de agarre, con medios manuales y carga manual de escombros sobre camión o contenedor."},{"$f":"IFERROR((VLOOKUP(Hoja2!G2,DATOS!$A$7:$G$202,3,FALSE)),\"\")","v":"m2"},{"$f":"IFERROR(IF((VLOOKUP(Hoja2!G2,DATOS!$A$7:$G$202,4,FALSE))<>0,(IFERROR((VLOOKUP(Hoja2!G2,DATOS!$A$7:$G$202,4,FALSE)),\"\")),\"\"),\"\")","v":5},{"$f":"IFERROR(IF((VLOOKUP(Hoja2!G2,DATOS!$A$7:$G$202,5,FALSE))<>0,(IFERROR((VLOOKUP(Hoja2!G2,DATOS!$A$7:$G$202,5,FALSE)),\"\")),\"\"),\"\")","v":""},{"$f":"IFERROR(IF((VLOOKUP(Hoja2!G2,DATOS!$A$7:$G$202,6,FALSE))<>0,(IFERROR((VLOOKUP(Hoja2!G2,DATOS!$A$7:$G$202,6,FALSE)),\"\")),\"\"),\"\")","v":""},null,{"$f":"IF(SUM(D7:F7)<>0,SUM(D7:F7),\"\")","v":5}]
[null,null,null,null,null,null,null,{"$f":"IF(SUM(D8:F8)<>0,SUM(D8:F8),\"\")","v":""}]
[{"$f":"IFERROR(VLOOKUP(Hoja2!G4,DATOS!$A$7:$G$202,1,FALSE),\"\")","v":2},{"$f":"IFERROR(VLOOKUP(Hoja2!G4,DATOS!$A$7:$G$202,2,FALSE),\"\")","v":"Demolición de otros elementos existentes en la zona de actuación. Sin recuperación del material."},{"$f":"IFERROR((VLOOKUP(Hoja2!G4,DATOS!$A$7:$G$202,3,FALSE)),\"\")","v":"ud"},{"$f":"IFERROR(IF((VLOOKUP(Hoja2!G4,DATOS!$A$7:$G$202,4,FALSE))<>0,(IFERROR((VLOOKUP(Hoja2!G4,DATOS!$A$7:$G$202,4,FALSE)),\"\")),\"\"),\"\")","v":1},{"$f":"IFERROR(IF((VLOOKUP(Hoja2!G4,DATOS!$A$7:$G$202,5,FALSE))<>0,(IFERROR((VLOOKUP(Hoja2!G4,DATOS!$A$7:$G$202,5,FALSE)),\"\")),\"\"),\"\")","v":""},{"$f":"IFERROR(IF((VLOOKUP(Hoja2!G4,DATOS!$A$7:$G$202,6,FALSE))<>0,(IFERROR((VLOOKUP(Hoja2!G4,DATOS!$A$7:$G$202,6,FALSE)),\"\")),\"\"),\"\")","v":""},null,1]
[null,null,null,null,null,null,null,""]
[{"$f":"IFERROR(VLOOKUP(Hoja2!G6,DATOS!$A$7:$G$202,1,FALSE),\"\")","v":3},{"$f":"IFERROR(VLOOKUP(Hoja2!G6,DATOS!$A$7:$G$202,2,FALSE),\"\")","v":"Formación de rampa pendiente máxima inferior al 10% "},{"$f":"IFERROR((VLOOKUP(Hoja2!G6,DATOS!$A$7:$G$202,3,FALSE)),\"\")","v":"m2"},{"$f":"IFERROR(IF((VLOOKUP(Hoja2!G6,DATOS!$A$7:$G$202,4,FALSE))<>0,(IFERROR((VLOOKUP(Hoja2!G6,DATOS!$A$7:$G$202,4,FALSE)),\"\")),\"\"),\"\")","v":8},{"$f":"IFERROR(IF((VLOOKUP(Hoja2!G6,DATOS!$A$7:$G$202,5,FALSE))<>0,(IFERROR((VLOOKUP(Hoja2!G6,DATOS!$A$7:$G$202,5,FALSE)),\"\")),\"\"),\"\")","v":""},{"$f":"IFERROR(IF((VLOOKUP(Hoja2!G6,DATOS!$A$7:$G$202,6,FALSE))<>0,(IFERROR((VLOOKUP(Hoja2!G6,DATOS!$A$7:$G$202,6,FALSE)),\"\")),\"\"),\"\")","v":""},null,8]
[null,null,null,null,null,null,null,""]
[{"$f":"IFERROR(VLOOKUP(Hoja2!G8,DATOS!$A$7:$G$202,1,FALSE),\"\")","v":4},{"$f":"IFERROR(VLOOKUP(Hoja2!G8,DATOS!$A$7:$G$202,2,FALSE),\"\")","v":"Solado de baldosas cerámicas de gres porcelánico, de 60x30 cm, a elegir de entre las muestras propuestas, recibidas con mortero de cemento M-5 de 3 cm de espesor y rejuntadas con lechada de cemento blanco, L, BL-V 22,5, para junta mínima (entre 1,5 y 3 mm), coloreada con la misma tonalidad de las piezas."},{"$f":"IFERROR((VLOOKUP(Hoja2!G8,DATOS!$A$7:$G$202,3,FALSE)),\"\")","v":"m2"},{"$f":"IFERROR(IF((VLOOKUP(Hoja2!G8,DATOS!$A$7:$G$202,4,FALSE))<>0,(IFERROR((VLOOKUP(Hoja2!G8,DATOS!$A$7:$G$202,4,FALSE)),\"\")),\"\"),\"\")","v":8},{"$f":"IFERROR(IF((VLOOKUP(Hoja2!G8,DATOS!$A$7:$G$202,5,FALSE))<>0,(IFERROR((VLOOKUP(Hoja2!G8,DATOS!$A$7:$G$202,5,FALSE)),\"\")),\"\"),\"\")","v":""},{"$f":"IFERROR(IF((VLOOKUP(Hoja2!G8,DATOS!$A$7:$G$202,6,FALSE))<>0,(IFERROR((VLOOKUP(Hoja2!G8,DATOS!$A$7:$G$202,6,FALSE)),\"\")),\"\"),\"\")","v":""},null,8]
[null,null,null,null,null,null,null,""]
[{"$f":"IFERROR(VLOOKUP(Hoja2!G10,DATOS!$A$7:$G$202,1,FALSE),\"\")","v":5},{"$f":"IFERROR(VLOOKUP(Hoja2!G10,DATOS!$A$7:$G$202,2,FALSE),\"\")","v":"Enlucido de yeso de aplicación en capa fina C6 en una superficie previamente guarnecida, sobre paramento vertical, de hasta 3 m de altura./Enfoscado de cemento, a buena vista, aplicado sobre un paramento vertical interior, hasta 3 m de altura, acabado superficial fratasado, con mortero de cemento M-5."},{"$f":"IFERROR((VLOOKUP(Hoja2!G10,DATOS!$A$7:$G$202,3,FALSE)),\"\")","v":"m2"},{"$f":"IFERROR(IF((VLOOKUP(Hoja2!G10,DATOS!$A$7:$G$202,4,FALSE))<>0,(IFERROR((VLOOKUP(Hoja2!G10,DATOS!$A$7:$G$202,4,FALSE)),\"\")),\"\"),\"\")","v":10},{"$f":"IFERROR(IF((VLOOKUP(Hoja2!G10,DATOS!$A$7:$G$202,5,FALSE))<>0,(IFERROR((VLOOKUP(Hoja2!G10,DATOS!$A$7:$G$202,5,FALSE)),\"\")),\"\"),\"\")","v":""},{"$f":"IFERROR(IF((VLOOKUP(Hoja2!G10,DATOS!$A$7:$G$202,6,FALSE))<>0,(IFERROR((VLOOKUP(Hoja2!G10,DATOS!$A$7:$G$202,6,FALSE)),\"\")),\"\"),\"\")","v":""},null,10]
[null,null,null,null,null,null,null,""]
[{"$f":"IFERROR(VLOOKUP(Hoja2!G12,DATOS!$A$7:$G$202,1,FALSE),\"\")","v":6},{"$f":"IFERROR(VLOOKUP(Hoja2!G12,DATOS!$A$7:$G$202,2,FALSE),\"\")","v":"Pintura plástica lisa mate color, en interiores,en paramentos horizontales y verticales, dos manos. Incluso lijado, mano de imprimación con plástico diluído, plastecido, lijado y acabado."},{"$f":"IFERROR((VLOOKUP(Hoja2!G12,DATOS!$A$7:$G$202,3,FALSE)),\"\")","v":"ud"},{"$f":"IFERROR(IF((VLOOKUP(Hoja2!G12,DATOS!$A$7:$G$202,4,FALSE))<>0,(IFERROR((VLOOKUP(Hoja2!G12,DATOS!$A$7:$G$202,4,FALSE)),\"\")),\"\"),\"\")","v":1},{"$f":"IFERROR(IF((VLOOKUP(Hoja2!G12,DATOS!$A$7:$G$202,5,FALSE))<>0,(IFERROR((VLOOKUP(Hoja2!G12,DATOS!$A$7:$G$202,5,FALSE)),\"\")),\"\"),\"\")","v":""},{"$f":"IFERROR(IF((VLOOKUP(Hoja2!G12,DATOS!$A$7:$G$202,6,FALSE))<>0,(IFERROR((VLOOKUP(Hoja2!G12,DATOS!$A$7:$G$202,6,FALSE)),\"\")),\"\"),\"\")","v":""},null,1]
[null,null,null,null,null,null,null,""]
[{"$f":"IFERROR(VLOOKUP(Hoja2!G14,DATOS!$A$7:$G$202,1,FALSE),\"\")","v":7},{"$f":"IFERROR(VLOOKUP(Hoja2!G14,DATOS!$A$7:$G$202,2,FALSE),\"\")","v":"Barandilla metálica de 100 cm de altura, diseño según especificaciones, para escalera recta de un tramo, fijada mediante atornillado en obra de fábrica."},{"$f":"IFERROR((VLOOKUP(Hoja2!G14,DATOS!$A$7:$G$202,3,FALSE)),\"\")","v":"ml"},{"$f":"IFERROR(IF((VLOOKUP(Hoja2!G14,DATOS!$A$7:$G$202,4,FALSE))<>0,(IFERROR((VLOOKUP(Hoja2!G14,DATOS!$A$7:$G$202,4,FALSE)),\"\")),\"\"),\"\")","v":7.5},{"$f":"IFERROR(IF((VLOOKUP(Hoja2!G14,DATOS!$A$7:$G$202,5,FALSE))<>0,(IFERROR((VLOOKUP(Hoja2!G14,DATOS!$A$7:$G$202,5,FALSE)),\"\")),\"\"),\"\")","v":""},{"$f":"IFERROR(IF((VLOOKUP(Hoja2!G14,DATOS!$A$7:$G$202,6,FALSE))<>0,(IFERROR((VLOOKUP(Hoja2!G14,DATOS!$A$7:$G$202,6,FALSE)),\"\")),\"\"),\"\")","v":""},null,7.5]
[null,null,null,null,null,null,null,""]
[{"$f":"IFERROR(VLOOKUP(Hoja2!G16,DATOS!$A$7:$G$202,1,FALSE),\"\")","v":8},{"$f":"IFERROR(VLOOKUP(Hoja2!G16,DATOS!$A$7:$G$202,2,FALSE),\"\")","v":"Pasamanos realizado en el material especificado, fijado mediante atornillado a obra."},{"$f":"IFERROR((VLOOKUP(Hoja2!G16,DATOS!$A$7:$G$202,3,FALSE)),\"\")","v":"ml"},{"$f":"IFERROR(IF((VLOOKUP(Hoja2!G16,DATOS!$A$7:$G$202,4,FALSE))<>0,(IFERROR((VLOOKUP(Hoja2!G16,DATOS!$A$7:$G$202,4,FALSE)),\"\")),\"\"),\"\")","v":7.5},{"$f":"IFERROR(IF((VLOOKUP(Hoja2!G16,DATOS!$A$7:$G$202,5,FALSE))<>0,(IFERROR((VLOOKUP(Hoja2!G16,DATOS!$A$7:$G$202,5,FALSE)),\"\")),\"\"),\"\")","v":""},{"$f":"IFERROR(IF((VLOOKUP(Hoja2!G16,DATOS!$A$7:$G$202,6,FALSE))<>0,(IFERROR((VLOOKUP(Hoja2!G16,DATOS!$A$7:$G$202,6,FALSE)),\"\")),\"\"),\"\")","v":""},null,7.5]
[null,null,null,null,null,null,null,""]
[{"$f":"IFERROR(VLOOKUP(Hoja2!G18,DATOS!$A$7:$G$202,1,FALSE),\"\")","v":9},{"$f":"IFERROR(VLOOKUP(Hoja2!G18,DATOS!$A$7:$G$202,2,FALSE),\"\")","v":"Aparato de emergencia con lámpara fluorescente de 165 Lum, con caja de empotrar en material antichoque y autoextingible, con kit de fijación, de superficie (superficie máxima de 33m2), grado de protección IP 223, con base antichoque y difusor de metacrilato, señalización permanente con autonomía superior a 3hora con baterías herméticas recargables, alimentación a 220 V, de 34x13x10cm, incluso base de enchufe, etiqueta de señalización, replanteo, montaje, pequeño material y conexionado."},{"$f":"IFERROR((VLOOKUP(Hoja2!G18,DATOS!$A$7:$G$202,3,FALSE)),\"\")","v":"ud"},{"$f":"IFERROR(IF((VLOOKUP(Hoja2!G18,DATOS!$A$7:$G$202,4,FALSE))<>0,(IFERROR((VLOOKUP(Hoja2!G18,DATOS!$A$7:$G$202,4,FALSE)),\"\")),\"\"),\"\")","v":1},{"$f":"IFERROR(IF((VLOOKUP(Hoja2!G18,DATOS!$A$7:$G$202,5,FALSE))<>0,(IFERROR((VLOOKUP(Hoja2!G18,DATOS!$A$7:$G$202,5,FALSE)),\"\")),\"\"),\"\")","v":""},{"$f":"IFERROR(IF((VLOOKUP(Hoja2!G18,DATOS!$A$7:$G$202,6,FALSE))<>0,(IFERROR((VLOOKUP(Hoja2!G18,DATOS!$A$7:$G$202,6,FALSE)),\"\")),\"\"),\"\")","v":""},null,1]
[null,null,null,null,null,null,null,""]
[{"$f":"IFERROR(VLOOKUP(Hoja2!G20,DATOS!$A$7:$G$202,1,FALSE),\"\")","v":10},{"$f":"IFERROR(VLOOKUP(Hoja2!G20,DATOS!$A$7:$G$202,2,FALSE),\"\")","v":"Extintor de polvo seco ABC de 6 Kg de capacidad, eficacia 21A-113B. Colocado en el exterior del recinto de riesgo especial y cad 15 m de recorrido, en cada planta, desde el origen de evacuación (si se actúa en dichas plantas). Incluso soporte, señalización según UNE 23033-1 y DBSI4 2 1 y colocación."},{"$f":"IFERROR((VLOOKUP(Hoja2!G20,DATOS!$A$7:$G$202,3,FALSE)),\"\")","v":"ud"},{"$f":"IFERROR(IF((VLOOKUP(Hoja2!G20,DATOS!$A$7:$G$202,4,FALSE))<>0,(IFERROR((VLOOKUP(Hoja2!G20,DATOS!$A$7:$G$202,4,FALSE)),\"\")),\"\"),\"\")","v":1},{"$f":"IFERROR(IF((VLOOKUP(Hoja2!G20,DATOS!$A$7:$G$202,5,FALSE))<>0,(IFERROR((VLOOKUP(Hoja2!G20,DATOS!$A$7:$G$202,5,FALSE)),\"\")),\"\"),\"\")","v":""},{"$f":"IFERROR(IF((VLOOKUP(Hoja2!G20,DATOS!$A$7:$G$202,6,FALSE))<>0,(IFERROR((VLOOKUP(Hoja2!G20,DATOS!$A$7:$G$202,6,FALSE)),\"\")),\"\"),\"\")","v":""},null,1]
[null,null,null,null,null,null,null,""]
[{"$f":"IFERROR(VLOOKUP(Hoja2!G22,DATOS!$A$7:$G$202,1,FALSE),\"\")","v":""},{"$f":"IFERROR(VLOOKUP(Hoja2!G22,DATOS!$A$7:$G$202,2,FALSE),\"\")","v":""},{"$f":"IFERROR((VLOOKUP(Hoja2!G22,DATOS!$A$7:$G$202,3,FALSE)),\"\")","v":""},{"$f":"IFERROR(IF((VLOOKUP(Hoja2!G22,DATOS!$A$7:$G$202,4,FALSE))<>0,(IFERROR((VLOOKUP(Hoja2!G22,DATOS!$A$7:$G$202,4,FALSE)),\"\")),\"\"),\"\")","v":""},{"$f":"IFERROR(IF((VLOOKUP(Hoja2!G22,DATOS!$A$7:$G$202,5,FALSE))<>0,(IFERROR((VLOOKUP(Hoja2!G22,DATOS!$A$7:$G$202,5,FALSE)),\"\")),\"\"),\"\")","v":""},{"$f":"IFERROR(IF((VLOOKUP(Hoja2!G22,DATOS!$A$7:$G$202,6,FALSE))<>0,(IFERROR((VLOOKUP(Hoja2!G22,DATOS!$A$7:$G$202,6,FALSE)),\"\")),\"\"),\"\")","v":""},null,""]
[null,null,null,null,null,null,null,""]
[{"$f":"IFERROR(VLOOKUP(Hoja2!G24,DATOS!$A$7:$G$202,1,FALSE),\"\")","v":""},{"$f":"IFERROR(VLOOKUP(Hoja2!G24,DATOS!$A$7:$G$202,2,FALSE),\"\")","v":""},{"$f":"IFERROR((VLOOKUP(Hoja2!G24,DATOS!$A$7:$G$202,3,FALSE)),\"\")","v":""},{"$f":"IFERROR(IF((VLOOKUP(Hoja2!G24,DATOS!$A$7:$G$202,4,FALSE))<>0,(IFERROR((VLOOKUP(Hoja2!G24,DATOS!$A$7:$G$202,4,FALSE)),\"\")),\"\"),\"\")","v":""},{"$f":"IFERROR(IF((VLOOKUP(Hoja2!G24,DATOS!$A$7:$G$202,5,FALSE))<>0,(IFERROR((VLOOKUP(Hoja2!G24,DATOS!$A$7:$G$202,5,FALSE)),\"\")),\"\"),\"\")","v":""},{"$f":"IFERROR(IF((VLOOKUP(Hoja2!G24,DATOS!$A$7:$G$202,6,FALSE))<>0,(IFERROR((VLOOKUP(Hoja2!G24,DATOS!$A$7:$G$202,6,FALSE)),\"\")),\"\"),\"\")","v":""},null,""]
[null,null,null,null,null,null,null,""]
[{"$f":"IFERROR(VLOOKUP(Hoja2!G26,DATOS!$A$7:$G$202,1,FALSE),\"\")","v":""},{"$f":"IFERROR(VLOOKUP(Hoja2!G26,DATOS!$A$7:$G$202,2,FALSE),\"\")","v":""},{"$f":"IFERROR((VLOOKUP(Hoja2!G26,DATOS!$A$7:$G$202,3,FALSE)),\"\")","v":""},{"$f":"IFERROR(IF((VLOOKUP(Hoja2!G26,DATOS!$A$7:$G$202,4,FALSE))<>0,(IFERROR((VLOOKUP(Hoja2!G26,DATOS!$A$7:$G$202,4,FALSE)),\"\")),\"\"),\"\")","v":""},{"$f":"IFERROR(IF((VLOOKUP(Hoja2!G26,DATOS!$A$7:$G$202,5,FALSE))<>0,(IFERROR((VLOOKUP(Hoja2!G26,DATOS!$A$7:$G$202,5,FALSE)),\"\")),\"\"),\"\")","v":""},{"$f":"IFERROR(IF((VLOOKUP(Hoja2!G26,DATOS!$A$7:$G$202,6,FALSE))<>0,(IFERROR((VLOOKUP(Hoja2!G26,DATOS!$A$7:$G$202,6,FALSE)),\"\")),\"\"),\"\")","v":""},null,""]
[null,null,null,null,null,null,null,""]
[{"$f":"IFERROR(VLOOKUP(Hoja2!G28,DATOS!$A$7:$G$202,1,FALSE),\"\")","v":""},{"$f":"IFERROR(VLOOKUP(Hoja2!G28,DATOS!$A$7:$G$202,2,FALSE),\"\")","v":""},{"$f":"IFERROR((VLOOKUP(Hoja2!G28,DATOS!$A$7:$G$202,3,FALSE)),\"\")","v":""},{"$f":"IFERROR(IF((VLOOKUP(Hoja2!G28,DATOS!$A$7:$G$202,4,FALSE))<>0,(IFERROR((VLOOKUP(Hoja2!G28,DATOS!$A$7:$G$202,4,FALSE)),\"\")),\"\"),\"\")","v":""},{"$f":"IFERROR(IF((VLOOKUP(Hoja2!G28,DATOS!$A$7:$G$202,5,FALSE))<>0,(IFERROR((VLOOKUP(Hoja2!G28,DATOS!$A$7:$G$202,5,FALSE)),\"\")),\"\"),\"\")","v":""},{"$f":"IFERROR(IF((VLOOKUP(Hoja2!G28,DATOS!$A$7:$G$202,6,FALSE))<>0,(IFERROR((VLOOKUP(Hoja2!G28,DATOS!$A$7:$G$202,6,FALSE)),\"\")),\"\"),\"\")","v":""},null,""]

{"sheet":"Hoja2","index":4,"n_rows":44,"n_cols":7,"rows_kept":44,"cut":false,"hidden":false,"merged":[]}
[]
[null,null,null,null,null,null,1]
[]
[null,null,null,null,null,null,2]
[]
[null,null,null,null,null,null,3]
[]
[null,null,null,null,null,null,4]
[]
[null,null,null,null,null,null,5]
[]
[null,null,null,null,null,null,6]
[]
[null,null,null,null,null,null,7]
[]
[null,null,null,null,null,null,8]
[]
[null,null,null,null,null,null,9]
[]
[null,null,null,null,null,null,10]
[]
[null,null,null,null,null,null,11]
[]
[null,null,null,null,null,null,12]
[]
[null,null,null,null,null,null,13]
[]
[null,null,null,null,null,null,14]
[]
[null,null,null,null,null,null,15]
[]
[null,null,null,null,null,null,16]
[]
[null,null,null,null,null,null,17]
[]
[null,null,null,null,null,null,18]
[]
[null,null,null,null,null,null,19]
[]
[null,null,null,null,null,null,20]
{"$rows_left_out":4}